{"text_format":"1","workbook":"xlsx","n_sheets":10,"sheets":["Intro","<<<<Index>>>>","Navigation&Shortcuts&Pasting","Formula Overview","Logical Formulas","Misc. Tools","Design","Editing","NavSupport","Support"],"not_rendered":{"charts":2,"images":18,"macros":1,"external_links":3,"defined_names":6,"comments":0,"pivot_tables":0},"unopened":[],"bounds":{"document_bytes":16777216,"sheet_cells":100000,"rows_first":2000,"rows_last":500,"rows_between":2000,"halvings":0,"cell_chars":16384,"cell_head_chars":4096},"cells_cut":0,"cells_raw":0,"read":"whole","date_system":"1900"}

{"sheet":"Intro","index":0,"n_rows":76,"n_cols":21,"rows_kept":76,"cut":false,"hidden":false,"merged":[]}
[]
[]
[]
[]
[]
[]
[]
[]
[]
[]
{"$rows_left_out":67}
{"sheet":"<<<<Index>>>>","index":1,"n_rows":106,"n_cols":42,"rows_kept":106,"cut":false,"hidden":false,"merged":[[5,9,5,13],[7,9,7,11]]}
[]
[]
[]
[null,null,null,null,null,null,null,null,null,null,null,null,null,null,null,null,null,null,null,null,null,null,null,null,null,null,null,null,null,null,null,null,null,null,78]
[null,null,null,null,null,null,null,null,null,null,null,null,null,null,null,null,null,null,null,null,null,null,null,null,null,null,null,null,null,null,null,null,null,null,1,null,null,null,null,null,null,"use this as the reference for the cell input"]
[null,null,null,null,null,null,null,null,null,"Index",null,null,null,null,null,null,null,null,null,null,null,null,null,null,null,null,null,null,null,null,null,null,null,null,1,{"$f":"VLOOKUP(AI6,AH8:AI106,2,FALSE)","v":"The Essentials"},{"$f":"VLOOKUP(AI6,AH8:AN106,7,FALSE)","v":0},null,null,null,null,"1.1 Using the Mouse"]
[]
[null,null,null,null,null,null,null,null,null,"Lesson",null,null,"Status","Mark Section",null,null,"Exercise Status",null,null,null,null,null,null,"Difficulty",null,null,null,null,null,null,null,null,null,null,"Jump To:"]
[null,null,null,null,null,null,null,null,null,"The Essentials",null,null,null,null,null,null,null,null,null,null,null,null,null,null,null,null,null,null,null,null,null,null,null,1,"The Essentials"]
[null,null,null,null,null,null,null,null,null,null,null,"1.1 The Basics",null,null,null,{"$f":"NavSupport!R7","v":""},{"$f":"NavSupport!Q7","v":""},null,null,null,null,null,null,"Beginner",{"$f":"M10","v":0},null,"Complete",null,"Flag",null,{"$f":"NavSupport!N7","v":0},{"$f":"NavSupport!K7","v":0},null,{"$f":"AH9+1","v":2},null,"1.1 The Basics",null,null,null,"zNav_1_1_The_Basics"]
{"$rows_left_out":97}
{"sheet":"Navigation&Shortcuts&Pasting","index":2,"n_rows":191,"n_cols":55,"rows_kept":191,"cut":false,"hidden":false,"merged":[[53,2,56,4],[53,9,56,11]]}
[]
[]
[]
[]
[]
[]
[]
[]
[null,null,null,null,null,null,null,null,null,null,null,true]
[]
{"$rows_left_out":182}
{"sheet":"Formula Overview","index":3,"n_rows":129,"n_cols":55,"rows_kept":129,"cut":false,"hidden":false,"merged":[]}
[]
[]
[]
[]
[]
[]
[]
[]
[]
[]
{"$rows_left_out":120}
{"sheet":"Logical Formulas","index":4,"n_rows":145,"n_cols":55,"rows_kept":145,"cut":false,"hidden":false,"merged":[]}
[]
[]
[]
[]
[]
[]
[]
[]
[]
[]
{"$rows_left_out":136}
{"sheet":"Misc. Tools","index":5,"n_rows":38,"n_cols":55,"rows_kept":38,"cut":false,"hidden":false,"merged":[]}
[]
[]
[]
[]
[]
[]
[]
[]
[]
[]
{"$rows_left_out":29}
{"sheet":"Design","index":6,"n_rows":287,"n_cols":55,"rows_kept":287,"cut":false,"hidden":false,"merged":[]}
[]
[]
[]
[]
[]
[]
[]
[]
[]
[]
{"$rows_left_out":278}
{"sheet":"Editing","index":7,"n_rows":276,"n_cols":55,"rows_kept":276,"cut":false,"hidden":false,"merged":[]}
[]
[]
[]
[]
[]
[]
[]
[]
[]
[]
{"$rows_left_out":267}
{"sheet":"NavSupport","index":8,"n_rows":103,"n_cols":200,"rows_kept":103,"cut":false,"hidden":true,"merged":[]}
["Button Nav",null,null,null,null,null,null,null,null,null,null,null,null,null,null,"add some rand generator that locks in",null,null,null,"we need to add the webinar survey stuff to the format…. "]
["'Essentials!'AZ17",null,null,null,null,null,null,null,null,null,null,null,null,null,null,null,null,null,null,"ID","ExerciseSet_1_1_NumberTried","ExerciseSet_1_1_NumberCompleted","ExerciseSet_1_1_BestTime","ExerciseSet_2_1_NumberTried","ExerciseSet_2_1_NumberCompleted","ExerciseSet_2_1_BestTime","ExerciseSet_2_2_NumberTried","ExerciseSet_2_2_NumberCompleted","ExerciseSet_2_2_BestTime","ExerciseSet_2_3_NumberTried","ExerciseSet_2_3_NumberCompleted","ExerciseSet_2_3_BestTime","ExerciseSet_3_1_NumberTried","ExerciseSet_3_1_NumberCompleted","ExerciseSet_3_1_BestTime","ExerciseSet_4_1_NumberTried","ExerciseSet_4_1_NumberCompleted","ExerciseSet_4_1_BestTime","ExerciseSet_4_2_NumberTried","ExerciseSet_4_2_NumberCompleted","ExerciseSet_4_2_BestTime","1_The_Basics_Flag","2_Menus_and_Customization_Flag","1_Using_the_Mouse_Flag","2_Navigating_and_Selecting_Cells_Flag","3_Shortcuts_and_Hotkeys_Flag","4_Cutting_Pasting_and_Paste_Special_Flag","1_Format_Menu_Flag","2_Conditional_Formatting_Flag","3_Create_Tables_Flag","4_Shade_Alternate_Rows_Flag","1_Rows_and_Columns_Flag","2_Sheets_Flag","3_Cell_References_and_Rows_Columns_Flag","ExerciseSet_1_1_Flag","1_Formula_Basics_Flag","2_Formula_Basics_Continued_Flag","1_If_Statements_Flag","2_And_Or_Statements_and_Nested_Formulas_Flag","3_IsNumber_IfError_and_Other_Is_Functions_Flag","1_Average_Count_and_Sum_Flag","2_Wildcards_Flag","3_Statistics_Math_and_Finance_Formulas_Flag","4_Rand_and_RandBetween_Flag","5_Array_Formulas_Flag","1_Vlookups_and_Hlookups_Flag","2_Other_Lookups_and_Mastering_Nested_Formulas_Flag","3_Cells_Rows_and_Columns_Flag","4_Indirect_Flag","1_Text_Basics_Flag","2_Find_Left_Right_and_Mid_Flag","3_Text_Cleanup_Flag","4_Text_to_Columns_Flag","5_Text_Formulas_Flag","1_Date_Basics_Flag","2_Date_Formulas_Flag","ExerciseSet_2_1_flag","ExerciseSet_2_2_flag","ExerciseSet_2_3_flag","1_Sorting_Flag","2_Filtering_Flag","3_Wildcards_Flag","4_Advanced_Filters_Flag","1_Chart_Types_Flag","2_Chart_Basics_Flag","3_Advanced_Charting_Example_1_Flag","4_Advanced_Charting_Example_2_Flag","1_Pivot_Tables_Flag","2_Slicer_Flag","3_PivotCharts_Flag","1_Goal_Seek_Flag","2_Data_Tables_Sensitivity_Analysis_Flag","3_Download_Stock_Prices_Quickly_Flag","ExerciseSet_3_1_flag","Best_Practices_Overview_Flag","1_Basic_Spreadsheet_Design_Flag","2_Rounding_and_Add_Checking_Flag","3_Calculation_Options_Flag","4_Named_Ranges_Flag","5_Data_Validation_Flag","6_Form_Controls_Flag","1_Find_and_Replace_Flag","2_Go_To_Flag","3_Duplicates_and_Unique_Values_Flag","1_Review_Ribbon_Flag","2_Formula_Ribbon_Flag","ExerciseSet_4_1_flag","1_Printing_Flag","1_Window_Ribbon_Flag","2_Rest_of_View_Options_Flag","1_Workbook_Protection_Flag","Navigation_Shortcuts_Pasting_R_48","Navigation_Shortcuts_Pasting_R_57","Navigation_Shortcuts_Pasting_R_68","Navigation_Shortcuts_Pasting_R_289","Navigation_Shortcuts_Pasting_R_301","Navigation_Shortcuts_Pasting_R_314","Formula_Overview_R_96","Formula_Overview_R_104","Formula_Overview_R_125","Logical_Formulas_R_74","Logical_Formulas_R_120","Logical_Formulas_R_141","Logical_Formulas_R_162","Logical_Formulas_R_194","Stat_Math_Fin_CSE_Formulas_R_35","Stat_Math_Fin_CSE_Formulas_R_38","Stat_Math_Fin_CSE_Formulas_R_41","Stat_Math_Fin_CSE_Formulas_R_45","Stat_Math_Fin_CSE_Formulas_R_49","Stat_Math_Fin_CSE_Formulas_R_59","Stat_Math_Fin_CSE_Formulas_R_100","Stat_Math_Fin_CSE_Formulas_R_113","Stat_Math_Fin_CSE_Formulas_R_149","Stat_Math_Fin_CSE_Formulas_R_158","Stat_Math_Fin_CSE_Formulas_R_172","Stat_Math_Fin_CSE_Formulas_R_183","Stat_Math_Fin_CSE_Formulas_R_190","Stat_Math_Fin_CSE_Formulas_R_206","Stat_Math_Fin_CSE_Formulas_R_218","Stat_Math_Fin_CSE_Formulas_R_221","Stat_Math_Fin_CSE_Formulas_R_225","Stat_Math_Fin_CSE_Formulas_R_228","Stat_Math_Fin_CSE_Formulas_R_245","Stat_Math_Fin_CSE_Formulas_R_284","Stat_Math_Fin_CSE_Formulas_R_319","Stat_Math_Fin_CSE_Formulas_R_337","Lookup_Formulas_R_39","Lookup_Formulas_R_55","Lookup_Formulas_R_59","Lookup_Formulas_R_72","Lookup_Formulas_R_86","Lookup_Formulas_R_89","Lookup_Formulas_R_103","Lookup_Formulas_R_113","Lookup_Formulas_R_134","Lookup_Formulas_R_172","Lookup_Formulas_R_227","Lookup_Formulas_R_232","Lookup_Formulas_R_280","Lookup_Formulas_R_282","Lookup_Formulas_R_298","Lookup_Formulas_R_346","Text_Formulas_Text_R_30","Text_Formulas_Text_R_41","Text_Formulas_Text_R_48","Text_Formulas_Text_R_56","Text_Formulas_Text_R_72","Text_Formulas_Text_R_88","Text_Formulas_Text_R_129","Text_Formulas_Text_R_147","Text_Formulas_Text_R_160","Text_Formulas_Text_R_176","Text_Formulas_Text_R_179","Text_Formulas_Text_R_182","Text_Formulas_Text_R_187","Text_Formulas_Text_R_217","Text_Formulas_Text_R_226","Text_Formulas_Text_R_232","Text_Formulas_Text_R_276","Date_Formulas_R_72","Date_Formulas_R_83","Date_Formulas_R_99","Date_Formulas_R_113","Sorting_Autofilter_datatools_R_83","Sorting_Autofilter_datatools_R_101","Sorting_Autofilter_datatools_R_121","Sorting_Autofilter_datatools_R_209","Sorting_Autofilter_datatools_R_234","Sorting_Autofilter_datatools_R_330","Misc_Tools_R_33","Misc_Tools_R_72","Design_R_87","Design_V_106","Editing_R_56","Editing_R_94","Editing_R_112","Editing_R_175","Editing_R_239","Editing_R_272"]
[]
[null,null,"Sheet","Section","Sheet2","Row","Reference"]
[]
[null,1,"Essentials",null,null,null,null,null,"Row",null,"# Exercises",null,null,"# Exercises Completed"]
["1.1 The Basics","1.1 The Basics",null,"1. The Basics","Essentials",17,"'Essentials!'AZ17",null,{"$f":"MATCH(E7,Support!$BR$10:$BR$34,0)+9","v":10},{"$f":"COUNTIF(INDIRECT(\"support!BS\"&$I7&\":CN\"&$I7),\"<\"&$F8)","v":0},{"$f":"J7","v":0},null,{"$f":"COUNTIF(INDIRECT(\"support!BS\"&($I7+81)&\":CN\"&($I7+81)),\"<\"&($F8))","v":0},{"$f":"M7","v":0},null,null,{"$f":"IF(OR(K7=\"\",K7=0),\"\",N7&\" of \"&K7&\"\")","v":""},{"$f":"IF(ISERROR(N7/K7),\"\",N7/K7)","v":""},null,1,"1_The_Basics_Flag","'Essentials!'AZ17"]
["1.2 Menus and Customization","1.2 Menus and Customization",null,"2. Menus and Customization","Essentials",91,"'Essentials!'AZ91",null,{"$f":"MATCH(E8,Support!$BR$10:$BR$34,0)+9","v":10},{"$f":"COUNTIF(INDIRECT(\"support!BS\"&$I8&\":CN\"&$I8),\"<\"&$F10)","v":0},null,null,{"$f":"COUNTIF(INDIRECT(\"support!BS\"&($I8+81)&\":CN\"&($I8+81)),\"<\"&($F10))","v":0},null,null,null,{"$f":"IF(OR(K8=\"\",K8=0),\"\",N8&\" of \"&K8&\"\")","v":""},{"$f":"IF(ISERROR(N8/K8),\"\",N8/K8)","v":""},null,2,"2_Menus_and_Customization_Flag","'Essentials!'AZ91"]
["1.3 Excel Layout","1.3 Excel Layout",null,"3. Excel Layout","Essentials",140,"Essentials!'AZ140",null,{"$f":"MATCH(E9,Support!$BR$10:$BR$34,0)+9","v":10},{"$f":"COUNTIF(INDIRECT(\"support!BS\"&$I9&\":CN\"&$I9),\"<\"&$F11)","v":0},null,null,{"$f":"COUNTIF(INDIRECT(\"support!BS\"&($I9+81)&\":CN\"&($I9+81)),\"<\"&($F11))","v":0},null,null,null,"","",null,2,"2_Menus_and_Customization_Flag","Essentials!'AZ140"]
[null,2,{"$f":"E11","v":"Navigation&Shortcuts&Pasting"},null,null,600,null,null,{"$f":"MATCH(E10,Support!$BR$10:$BR$34,0)+9","v":{"$error":"#N/A"}},{"$f":"COUNTIF(INDIRECT(\"support!BS\"&$I10&\":CN\"&$I10),\"<\"&$F11)","v":{"$error":"#N/A"}},null,null,{"$f":"COUNTIF(INDIRECT(\"support!BS\"&($I10+81)&\":CN\"&($I10+81)),\"<\"&($F11))","v":{"$error":"#N/A"}},null,null,null,"","",null,null,null,0]
{"$rows_left_out":94}
{"sheet":"Support","index":9,"n_rows":495,"n_cols":102,"rows_kept":495,"cut":false,"hidden":true,"merged":[]}
[null,"Column","AZ",null,null,"Sections",null,null,null,null,null,"bring in macro. Update this set up (add in worksheets… make sure each section is actually included….",null,null,null,null,null,null,null,null,null,null,null,null,null,null,null,null,null,null,null,null,null,null,null,null,null,null,null,"Column","R",null,null,null,null,"Completions",null,null,null,"remember in second section, what column to look at"]
[null,null,null,null,null,null,null,null,null,null,null,"Then we'll set up the macros"]
[null,null,"Sheet",null,null,null,null,null,null,null,null,null,null,null,null,null,null,null,null,null,null,null,null,null,null,null,null,null,null,null,null,null,null,null,null,null,null,null,null,null,"Sheet"]
[null,null,"Essentials","Navigation&Shortcuts&Pasting","Cell Formatting","Rows&Columns&Sheets","Exercise Set 1","Formula Overview","Logical Formulas","Stat&Math&Fin&CSE Formulas","Lookup Formulas","Text Formulas & Text","Date Formulas","Exericse Set 2","Sorting & Autofilter &datatools","Charts & Sparklines","Pivot Tables","Misc. Tools","Exercise Set 3","Best Practices Overview","Design","Editing","Review","Exercise Set 4","Printing","Viewing Excel","Security","Shapes & Objects","Shapes & Objects",null,null,null,null,null,null,null,null,null,null,null,"Essentials","Navigation&Shortcuts&Pasting","Cell Formatting","Rows&Columns&Sheets","Exercise Set 1","Formula Overview","Logical Formulas","Stat&Math&Fin&CSE Formulas","Lookup Formulas","Text Formulas & Text","Date Formulas","Exericse Set 2","Sorting & Autofilter &datatools","Charts & Sparklines","Pivot Tables","Misc. Tools","Exercise Set 3","Best Practices Overview","Design","Editing","Review","Exercise Set 4","Printing","Viewing Excel","Security","Shapes & Objects","Shapes & Objects"]
["Row",1,{"$error":"#REF!"},0,{"$error":"#REF!"},{"$error":"#REF!"},{"$error":"#REF!"},0,0,{"$error":"#REF!"},{"$error":"#REF!"},{"$error":"#REF!"},{"$error":"#REF!"},{"$error":"#REF!"},{"$error":"#REF!"},{"$error":"#REF!"},{"$error":"#REF!"},0,{"$error":"#REF!"},{"$error":"#REF!"},0,0,{"$error":"#REF!"},{"$error":"#REF!"},{"$error":"#REF!"},{"$error":"#REF!"},{"$error":"#REF!"},{"$error":"#REF!"},{"$error":"#REF!"},null,null,"Section","Sheet","Row","Reference",null,null,null,"Row",1,{"$error":"#REF!"},0,{"$error":"#REF!"},{"$error":"#REF!"},{"$error":"#REF!"},0,0,{"$error":"#REF!"},{"$error":"#REF!"},{"$error":"#REF!"},{"$error":"#REF!"},{"$error":"#REF!"},{"$error":"#REF!"},{"$error":"#REF!"},{"$error":"#REF!"},0,{"$error":"#REF!"},{"$error":"#REF!"},0,0,{"$error":"#REF!"},{"$error":"#REF!"},{"$error":"#REF!"},{"$error":"#REF!"},{"$error":"#REF!"},{"$error":"#REF!"},{"$error":"#REF!"},null,null,"Section","Sheet","Row","Reference"]
[null,2,{"$error":"#REF!"},0,{"$error":"#REF!"},{"$error":"#REF!"},{"$error":"#REF!"},0,0,{"$error":"#REF!"},{"$error":"#REF!"},{"$error":"#REF!"},{"$error":"#REF!"},{"$error":"#REF!"},{"$error":"#REF!"},{"$error":"#REF!"},{"$error":"#REF!"},0,{"$error":"#REF!"},{"$error":"#REF!"},0,0,{"$error":"#REF!"},{"$error":"#REF!"},{"$error":"#REF!"},{"$error":"#REF!"},{"$error":"#REF!"},{"$error":"#REF!"},{"$error":"#REF!"},null,null,"1. The Basics","Essentials",17,"'Essentials!'AZ17",null,null,null,null,2,{"$error":"#REF!"},0,{"$error":"#REF!"},{"$error":"#REF!"},{"$error":"#REF!"},0,0,{"$error":"#REF!"},{"$error":"#REF!"},{"$error":"#REF!"},{"$error":"#REF!"},{"$error":"#REF!"},{"$error":"#REF!"},{"$error":"#REF!"},{"$error":"#REF!"},0,{"$error":"#REF!"},{"$error":"#REF!"},0,0,{"$error":"#REF!"},{"$error":"#REF!"},{"$error":"#REF!"},{"$error":"#REF!"},{"$error":"#REF!"},{"$error":"#REF!"},{"$error":"#REF!"},null,null,"1. Using the Mouse",{"$f":"AO4","v":"Essentials"},{"$f":"AN22","v":18},{"$f":"\"'\"&BS6&\"!'\"&$C$1&BT6","v":"'Essentials!'AZ18"}]
[null,3,{"$error":"#REF!"},0,{"$error":"#REF!"},{"$error":"#REF!"},{"$error":"#REF!"},0,0,{"$error":"#REF!"},{"$error":"#REF!"},{"$error":"#REF!"},{"$error":"#REF!"},{"$error":"#REF!"},{"$error":"#REF!"},{"$error":"#REF!"},{"$error":"#REF!"},0,{"$error":"#REF!"},{"$error":"#REF!"},0,0,{"$error":"#REF!"},{"$error":"#REF!"},{"$error":"#REF!"},{"$error":"#REF!"},{"$error":"#REF!"},{"$error":"#REF!"},{"$error":"#REF!"},null,null,"2. Menus and Customization","Essentials",91,"'Essentials!'AZ91",null,null,null,null,3,{"$error":"#REF!"},0,{"$error":"#REF!"},{"$error":"#REF!"},{"$error":"#REF!"},0,0,{"$error":"#REF!"},{"$error":"#REF!"},{"$error":"#REF!"},{"$error":"#REF!"},{"$error":"#REF!"},{"$error":"#REF!"},{"$error":"#REF!"},{"$error":"#REF!"},0,{"$error":"#REF!"},{"$error":"#REF!"},0,0,{"$error":"#REF!"},{"$error":"#REF!"},{"$error":"#REF!"},{"$error":"#REF!"},{"$error":"#REF!"},{"$error":"#REF!"},{"$error":"#REF!"},null,null,{"$f":"INDEX($C$5:$C$390,MATCH(TRUE,$C$5:$C$390<>0,0))","v":{"$error":"#REF!"}}]
[null,4,{"$error":"#REF!"},0,{"$error":"#REF!"},{"$error":"#REF!"},{"$error":"#REF!"},0,0,{"$error":"#REF!"},{"$error":"#REF!"},{"$error":"#REF!"},{"$error":"#REF!"},{"$error":"#REF!"},{"$error":"#REF!"},{"$error":"#REF!"},{"$error":"#REF!"},0,{"$error":"#REF!"},{"$error":"#REF!"},0,0,{"$error":"#REF!"},{"$error":"#REF!"},{"$error":"#REF!"},{"$error":"#REF!"},{"$error":"#REF!"},{"$error":"#REF!"},{"$error":"#REF!"},null,null,"1. Using the Mouse","Navigation&Shortcuts&Pasting",24,"'Navigation&Shortcuts&Pasting!'AZ24",null,null,null,null,4,{"$error":"#REF!"},0,{"$error":"#REF!"},{"$error":"#REF!"},{"$error":"#REF!"},0,0,{"$error":"#REF!"},{"$error":"#REF!"},{"$error":"#REF!"},{"$error":"#REF!"},{"$error":"#REF!"},{"$error":"#REF!"},{"$error":"#REF!"},{"$error":"#REF!"},0,{"$error":"#REF!"},{"$error":"#REF!"},0,0,{"$error":"#REF!"},{"$error":"#REF!"},{"$error":"#REF!"},{"$error":"#REF!"},{"$error":"#REF!"},{"$error":"#REF!"},{"$error":"#REF!"}]
[null,5,{"$error":"#REF!"},0,{"$error":"#REF!"},{"$error":"#REF!"},{"$error":"#REF!"},0,0,{"$error":"#REF!"},{"$error":"#REF!"},{"$error":"#REF!"},{"$error":"#REF!"},{"$error":"#REF!"},{"$error":"#REF!"},{"$error":"#REF!"},{"$error":"#REF!"},0,{"$error":"#REF!"},{"$error":"#REF!"},0,0,{"$error":"#REF!"},{"$error":"#REF!"},{"$error":"#REF!"},{"$error":"#REF!"},{"$error":"#REF!"},{"$error":"#REF!"},{"$error":"#REF!"},null,null,"2. Navigating and Selecting Cells","Navigation&Shortcuts&Pasting",76,"'Navigation&Shortcuts&Pasting!'AZ76",null,null,null,null,5,{"$error":"#REF!"},0,{"$error":"#REF!"},{"$error":"#REF!"},{"$error":"#REF!"},0,0,{"$error":"#REF!"},{"$error":"#REF!"},{"$error":"#REF!"},{"$error":"#REF!"},{"$error":"#REF!"},{"$error":"#REF!"},{"$error":"#REF!"},{"$error":"#REF!"},0,{"$error":"#REF!"},{"$error":"#REF!"},0,0,{"$error":"#REF!"},{"$error":"#REF!"},{"$error":"#REF!"},{"$error":"#REF!"},{"$error":"#REF!"},{"$error":"#REF!"},{"$error":"#REF!"}]
[null,6,{"$error":"#REF!"},0,{"$error":"#REF!"},{"$error":"#REF!"},{"$error":"#REF!"},0,0,{"$error":"#REF!"},{"$error":"#REF!"},{"$error":"#REF!"},{"$error":"#REF!"},{"$error":"#REF!"},{"$error":"#REF!"},{"$error":"#REF!"},{"$error":"#REF!"},0,{"$error":"#REF!"},{"$error":"#REF!"},0,0,{"$error":"#REF!"},{"$error":"#REF!"},{"$error":"#REF!"},{"$error":"#REF!"},{"$error":"#REF!"},{"$error":"#REF!"},{"$error":"#REF!"},null,null,"3. Shortcuts and Hotkeys","Navigation&Shortcuts&Pasting",137,"'Navigation&Shortcuts&Pasting!'AZ137",null,null,null,null,6,{"$error":"#REF!"},0,{"$error":"#REF!"},{"$error":"#REF!"},{"$error":"#REF!"},0,0,{"$error":"#REF!"},{"$error":"#REF!"},{"$error":"#REF!"},{"$error":"#REF!"},{"$error":"#REF!"},{"$error":"#REF!"},{"$error":"#REF!"},{"$error":"#REF!"},0,{"$error":"#REF!"},{"$error":"#REF!"},0,0,{"$error":"#REF!"},{"$error":"#REF!"},{"$error":"#REF!"},{"$error":"#REF!"},{"$error":"#REF!"},{"$error":"#REF!"},{"$error":"#REF!"},null,null,"Essentials"]
{"$rows_left_out":485}